{"text_format":"1","workbook":"xlsx","n_sheets":8,"sheets":["1 - Instrucciones","2 - Identificacion Preliminar","3 - Identificacion de riesgos","4 - Planificacion y gestión","Historico","Análisis","Matriz de Riesgos","Parametros"],"not_rendered":{"charts":2,"images":3,"macros":1,"external_links":0,"defined_names":11,"comments":3,"pivot_tables":0},"unopened":[],"bounds":{"document_bytes":16777216,"sheet_cells":100000,"rows_first":2000,"rows_last":500,"rows_between":2000,"halvings":0,"cell_chars":16384,"cell_head_chars":4096},"cells_cut":0,"cells_raw":0,"read":"whole","date_system":"1900"}

{"sheet":"1 - Instrucciones","index":0,"n_rows":44,"n_cols":5,"rows_kept":44,"cut":false,"hidden":false,"merged":[[43,2,43,6],[9,4,9,5],[11,4,11,5],[12,4,12,5],[25,2,25,6],[28,2,28,6],[10,4,10,5],[31,2,31,6],[34,2,34,6],[37,2,37,6],[40,2,40,6]]}
[]
[]
[]
[]
[]
[]
[]
[1,"Datos Básicos del Proyecto"]
[]
[null,"Nombre de Aplicación:",null,null,"-------------------------------------------------------------------------------------------"]
[null,"VERSIÓN:",null,null,"-------------------------------------------------------------------------------------------"]
[null,"Jefe de Proyecto",null,null,"-------------------------------------------------------------------------------------------"]
[null,"Proveedor",null,null,"-------------------------------------------------------------------------------------------"]
[null,{"$f":"CONCATENATE(\"Cantidad de Riesgos Identificados: \",'Matriz de Riesgos'!K14+'Matriz de Riesgos'!K15+'Matriz de Riesgos'!K16)","v":"Cantidad de Riesgos Identificados: 0"}]
[null,{"$f":"CONCATENATE(\"Cantidad de Riesgos Alto Impacto: \",'Matriz de Riesgos'!K14)","v":"Cantidad de Riesgos Alto Impacto: 0"}]
[]
[]
[2,"Instructivo de uso"]
[]
[null,"Hojas del Excel"]
[]
[null,"1 - Instrucciones"]
[null,null,"Llenar campos de Nombre de Aplicación,  VERSIÓN, Jefe de Proyecto y Proveedor"]
[]
[null,"2 - Identificacion Preliminar"]
[null,null,"Responder a las Preguntas que apliquen a su VERSIÓN si Representa un riesgo la temática planteada a la Pregunta, responda SI. Si la respuesta fue SI indicar el impacto de la ocurrencia del riesgo identificado y redactar el texto del Riesgo identificado. De responder NO / No aplica, no hacer nada. Si se encuentra más de un riesgo por Pregunta, insertar filas debajo de la Pregunta que origina los Riesgos. Si hay un riesgo que no surja de una Pregunta ponerlo directamente en la hoja: \"3 - Identificación de Riesgos\". Si hay preguntas que no estén en el cuestionario enviar solicitud a Servicios Horizontales para evaluar su inclusión en el listado y poner su Riesgo asociado directamente en la hoja: \"3 - Identificación de Riesgos\".\nNOTA: no poner los Riesgos más de una vez."]
[]
[null,"3 - Identificacion de Riesgos"]
[null,null,"Se incorporan los Riesgos hallados a través de las Preguntas, se incorporan otros Riesgos no derivados de las Preguntas de la hoja \"2 - Identificación Preliminar\". Se asigna Categoría y SubCategoría para el Riesgo hallado (de no existir una Categoría y/o SubCategoría adecuada se plantea el caso a Servicios Horizontales para efectuar la revisión de las mismas) "]
[]
{"$rows_left_out":15}
{"sheet":"2 - Identificacion Preliminar","index":1,"n_rows":194,"n_cols":16,"rows_kept":194,"cut":false,"hidden":false,"merged":[]}
[]
[]
[null,"Preguntas para identificar riesgos a partir de las fuentes que los originan"]
[]
[null,{"$f":"CONCATENATE('1 - Instrucciones'!B10,\": \",'1 - Instrucciones'!E10)","v":"Nombre de Aplicación:: -------------------------------------------------------------------------------------------"}]
[null,{"$f":"CONCATENATE('1 - Instrucciones'!B11,\": \",'1 - Instrucciones'!E11)","v":"VERSIÓN:: -------------------------------------------------------------------------------------------"}]
[null,{"$f":"CONCATENATE('1 - Instrucciones'!B12,\": \",'1 - Instrucciones'!E12)","v":"Jefe de Proyecto: -------------------------------------------------------------------------------------------"}]
[null,{"$f":"CONCATENATE('1 - Instrucciones'!B13,\": \",'1 - Instrucciones'!E13)","v":"Proveedor: -------------------------------------------------------------------------------------------"}]
[null,{"$f":"CONCATENATE(\"Cantidad de Riesgos Identificados: \",COUNTA(D14:D194))","v":"Cantidad de Riesgos Identificados: 1"},null,null,null,null,null,null,null,null,null,null,null,"SI",null,"Alto"]
[null,{"$f":"CONCATENATE(\"Cantidad de Riesgos Alto Impacto: \",COUNTIFS(C14:C194,\"NO\",E14:E194,\"Alto\"))","v":"Cantidad de Riesgos Alto Impacto: 0"},null,null,null,null,null,null,null,null,null,null,null,"NO",null,"Bajo"]
[null,null,"Representa un riesgo \n(SI/NO/No aplica)","Riesgos identificados","Impacto si ocurre (Alto/Bajo/No aplica)",null,null,null,null,null,null,null,null,"No aplica",null,"No aplica"]
[]
[null,"Riesgos relativos a SAS"]
[null,"La alta gerencia está comprometida con el proyecto","SI","si","Alto"]
[null,"La solución tiene claros beneficios para el SAS",null,null,{"$f":"IF(OR(C15=\"NO\",C15=\"No aplica\"),\"No aplica\",\"\")","v":""}]
[null,"El proyecto está alineado a la estrategia de la Organización",null,null,""]
[null,"Está claramente definida y comunicada la estrategia a seguir con el proyecto",null,null,""]
[null,"El proyecto está directamente relacionado con alguna de las metas del SAS",null,null,""]
[null,"Se cuenta con el compromiso de las demás áreas que intervienen en el proyecto",null,null,""]
[null,"Todas las áreas involucradas en el proyecto están comprometidas a apoyar al proyecto con los recursos necesarios en los momentos oportunos",null,null,""]
[null,"Otras áreas del SAS además del área que gerencia el proyecto, poseen necesidades del mismo",null,null,""]
[null,"Otras áreas del SAS además de la que gerencia el proyecto, tienen tareas asignadas al proyecto dentro de sus actividades",null,null,""]
[null,"Las áreas que participan y no están a cargo de la gerencia del proyecto tienen definida claramente la carga y tiempos necesarios para realizar las tareas asignadas",null,null,""]
[null,null,null,null,{"$f":"IF(OR(C24=\"NO\",C24=\"No aplica\"),\"No aplica\",\"\")","v":""}]
[null,"Riesgos relativos a las organizaciones participantes del proyecto",null,null,""]
[null,"Se poseen experiencias anteriores de trabajo entre las organizaciones participantes del proyecto? ¿Se conocen las lecciones aprendidas de dichas experiencias",null,null,""]
[null,"El proyecto está directamente alineado a la estrategia de SAS y las partes que intervienen",null,null,""]
[null,"Está claramente definida y comunicada la estrategia para todas las partes del proyecto",null,null,""]
[null,"La solución tiene claros beneficios percibidos por el usuario",null,null,""]
[null,"La solución a implementar en el proyecto es conocida y comprendida por la alta gerencia",null,null,""]
{"$rows_left_out":165}
{"sheet":"3 - Identificacion de riesgos","index":2,"n_rows":40,"n_cols":8,"rows_kept":40,"cut":false,"hidden":false,"merged":[]}
[]
[]
[null,"Identificación de Riesgos - (utilizar para Análisis y Priorización)",null,null,null,"Identificacion de riesgos"]
[]
[null,{"$f":"CONCATENATE('1 - Instrucciones'!B10,\": \",'1 - Instrucciones'!E10)","v":"Nombre de Aplicación:: -------------------------------------------------------------------------------------------"}]
[null,{"$f":"CONCATENATE('1 - Instrucciones'!B11,\": \",'1 - Instrucciones'!E11)","v":"VERSIÓN:: -------------------------------------------------------------------------------------------"}]
[null,{"$f":"CONCATENATE('1 - Instrucciones'!B12,\": \",'1 - Instrucciones'!E12)","v":"Jefe de Proyecto: -------------------------------------------------------------------------------------------"}]
[null,{"$f":"CONCATENATE('1 - Instrucciones'!B13,\": \",'1 - Instrucciones'!E13)","v":"Proveedor: -------------------------------------------------------------------------------------------"}]
[]
[null,"ID Riesgo","Título","Descripción","Clasificación / Categoría","Causas","Consecuencias","Destinatario"]
[null,"R001","si"]
[null,"R002"]
[null,"R003"]
[null,"R004"]
[null,"R005"]
[null,"R006"]
[null,"R007"]
[null,"R008"]
[null,"R009"]
[null,"R010"]
[null,"R011"]
[null,"R012"]
[null,"R013"]
[null,"R014"]
[null,"R015"]
[null,"R016"]
[null,"R017"]
[null,"R018"]
[null,"R019"]
[null,"R020"]
{"$rows_left_out":11}
{"sheet":"4 - Planificacion y gestión","index":3,"n_rows":3000,"n_cols":22,"rows_kept":3000,"cut":false,"hidden":false,"merged":[[9,17,9,21],[11,1,20,1],[9,13,9,16],[9,8,9,12],[9,2,9,7]]}
[]
[]
[null,null,"Planificación y gestión de riesgos"]
[]
[null,null,{"$f":"CONCATENATE('1 - Instrucciones'!B10,\": \",'1 - Instrucciones'!E10)","v":"Nombre de Aplicación:: -------------------------------------------------------------------------------------------"},null,null,{"$f":"CONCATENATE('1 - Instrucciones'!B12,\": \",'1 - Instrucciones'!E12)","v":"Jefe de Proyecto: -------------------------------------------------------------------------------------------"}]
[null,null,{"$f":"CONCATENATE('1 - Instrucciones'!B11,\": \",'1 - Instrucciones'!E11)","v":"VERSIÓN:: -------------------------------------------------------------------------------------------"},null,null,{"$f":"CONCATENATE('1 - Instrucciones'!B13,\": \",'1 - Instrucciones'!E13)","v":"Proveedor: -------------------------------------------------------------------------------------------"}]
[]
[null,null,"Fecha:    ",{"$f":"TODAY()","v":"2018-03-14"}]
[]
[null,null,"Análisis",null,null,null,null,null,"Gestión",null,null,null,null,"Plan de mitigación",null,null,null,"Plan de contingencia"]
[null,null,"ID Riesgo","Título","Probabilidad (Porcentaje)","Impacto (Numerico)","Exposición (Numeric)","Zona","Prioridad","Fecha límite","Estado","Motivo","Fecha estado","Tareas","Fecha inicio","Fecha fin","Recursos","Triggers","Tareas","Fecha inicio","Fecha fin","Recursos"]
[null,"GESTION",null,{"$f":"VLOOKUP(C12,'3 - Identificacion de riesgos'!$B$11:$G$41,2, FALSE)","v":{"$error":"#N/A"}},null,null,{"$f":"ROUND(E12*F12,2)","v":0},{"$f":"IF(OR(AND(F12=10,E12>0.4),AND(F12=8,E12>0.6),AND(F12=6,E12>0.8)),2,IF(OR(AND(F12=10),AND(F12=8,E12>0.2),AND(F12=6,E12>0.4),AND(F12=4,E12>0.6),AND(F12=2,E12>0.8)),1,0))","v":0},{"$f":"IF(AND(G12<>0,K12<>\"99 - CERRADO\",K12<>\"98 - RESUELTO\"),31-(G12*(H12+1)),99)","v":99},null,{"$f":"IF(OR(H12=1,H12=2),\"00 - EN GESTION\",\"\")","v":""}]
[null,null,null,{"$f":"VLOOKUP(C13,'3 - Identificacion de riesgos'!$B$11:$G$41,2, FALSE)","v":{"$error":"#N/A"}},null,null,0,0,99,null,""]
[null,null,null,{"$f":"VLOOKUP(C14,'3 - Identificacion de riesgos'!$B$11:$G$41,2, FALSE)","v":{"$error":"#N/A"}},null,null,0,0,99,null,""]
[null,null,null,{"$f":"VLOOKUP(C15,'3 - Identificacion de riesgos'!$B$11:$G$41,2, FALSE)","v":{"$error":"#N/A"}},null,null,0,0,99,null,""]
[null,null,null,{"$f":"VLOOKUP(C16,'3 - Identificacion de riesgos'!$B$11:$G$41,2, FALSE)","v":{"$error":"#N/A"}},null,null,0,0,99,null,""]
[null,null,null,{"$f":"VLOOKUP(C17,'3 - Identificacion de riesgos'!$B$11:$G$41,2, FALSE)","v":{"$error":"#N/A"}},null,null,0,0,99,null,""]
[null,null,null,{"$f":"VLOOKUP(C18,'3 - Identificacion de riesgos'!$B$11:$G$41,2, FALSE)","v":{"$error":"#N/A"}},null,null,0,0,99,null,""]
[null,null,null,{"$f":"VLOOKUP(C19,'3 - Identificacion de riesgos'!$B$11:$G$41,2, FALSE)","v":{"$error":"#N/A"}},null,null,0,0,99,null,{"$f":"IF(OR(H19=1,H19=2),\"00 - EN GESTION\",\"\")","v":""}]
[null,null,null,{"$f":"VLOOKUP(C20,'3 - Identificacion de riesgos'!$B$11:$G$41,2, FALSE)","v":{"$error":"#N/A"}},null,null,0,0,99,null,""]
[null,null,null,{"$f":"VLOOKUP(C21,'3 - Identificacion de riesgos'!$B$11:$G$41,2, FALSE)","v":{"$error":"#N/A"}},null,null,0,0,99,null,""]
[null,null,null,{"$f":"VLOOKUP(C22,'3 - Identificacion de riesgos'!$B$11:$G$41,2, FALSE)","v":{"$error":"#N/A"}},null,null,0,0,99,null,""]
[null,null,null,{"$f":"VLOOKUP(C23,'3 - Identificacion de riesgos'!$B$11:$G$41,2, FALSE)","v":{"$error":"#N/A"}},null,null,0,0,99,null,""]
[null,null,null,{"$f":"VLOOKUP(C24,'3 - Identificacion de riesgos'!$B$11:$G$41,2, FALSE)","v":{"$error":"#N/A"}},null,null,0,0,99,null,""]
[null,null,null,{"$f":"VLOOKUP(C25,'3 - Identificacion de riesgos'!$B$11:$G$41,2, FALSE)","v":{"$error":"#N/A"}},null,null,0,0,99,null,""]
[null,null,null,{"$f":"VLOOKUP(C26,'3 - Identificacion de riesgos'!$B$11:$G$41,2, FALSE)","v":{"$error":"#N/A"}},null,null,0,0,99,null,""]
[null,null,null,{"$f":"VLOOKUP(C27,'3 - Identificacion de riesgos'!$B$11:$G$41,2, FALSE)","v":{"$error":"#N/A"}},null,null,0,0,99,null,""]
[null,null,null,{"$f":"VLOOKUP(C28,'3 - Identificacion de riesgos'!$B$11:$G$41,2, FALSE)","v":{"$error":"#N/A"}},null,null,0,0,99,null,""]
[null,null,null,{"$f":"VLOOKUP(C29,'3 - Identificacion de riesgos'!$B$11:$G$41,2, FALSE)","v":{"$error":"#N/A"}},null,null,0,0,99,null,""]
[null,null,null,{"$f":"VLOOKUP(C30,'3 - Identificacion de riesgos'!$B$11:$G$41,2, FALSE)","v":{"$error":"#N/A"}},null,null,0,0,99,null,""]
{"$rows_left_out":2971}
{"sheet":"Historico","index":4,"n_rows":21,"n_cols":11,"rows_kept":21,"cut":false,"hidden":false,"merged":[]}
[]
[]
[null,"Histórico de los riesgos"]
[]
[null,{"$f":"CONCATENATE('1 - Instrucciones'!B10,\": \",'1 - Instrucciones'!E10)","v":"Nombre de Aplicación:: -------------------------------------------------------------------------------------------"},null,null,null,null,{"$f":"CONCATENATE('1 - Instrucciones'!B12,\": \",'1 - Instrucciones'!E12)","v":"Jefe de Proyecto: -------------------------------------------------------------------------------------------"}]
[null,{"$f":"CONCATENATE('1 - Instrucciones'!B11,\": \",'1 - Instrucciones'!E11)","v":"VERSIÓN:: -------------------------------------------------------------------------------------------"},null,null,null,null,{"$f":"CONCATENATE('1 - Instrucciones'!B13,\": \",'1 - Instrucciones'!E13)","v":"Proveedor: -------------------------------------------------------------------------------------------"}]
[]
[]
[]
[null,"Semana",{"$f":"Parametros!$B$15","v":"00 - EN GESTION"},{"$f":"Parametros!$B$16","v":"01 - ACTIVACION MITIGACION"},{"$f":"Parametros!$B$17","v":"02 - ACTIVACION CONTINGENCIA"},{"$f":"Parametros!$B$18","v":"98 - RESUELTO"},{"$f":"Parametros!$B$19","v":"99 - CERRADO"},"Total"]
[null,"2018-02-19",4,0,0,1,0,5]
[null,"2018-02-19",0,1,0,0,0,1]
[null,"2018-02-19",1,0,0,0,0,1]
[]
[null,null,null,null,null,null,null,null,null,"Estado","Cantidad"]
[null,null,null,null,null,null,null,null,null,"00 - EN GESTION",{"$f":"COUNTIF('4 - Planificacion y gestión'!$K$12:$K$41,J16)","v":0}]
[null,null,null,null,null,null,null,null,null,"01 - ACTIVACION MITIGACION",{"$f":"COUNTIF('4 - Planificacion y gestión'!$K$12:$K$41,J17)","v":0}]
[null,null,null,null,null,null,null,null,null,"02 - ACTIVACION CONTINGENCIA",{"$f":"COUNTIF('4 - Planificacion y gestión'!$K$12:$K$41,J18)","v":0}]
[null,null,null,null,null,null,null,null,null,"98 - RESUELTO",{"$f":"COUNTIF('4 - Planificacion y gestión'!$K$12:$K$41,J19)","v":0}]
[null,null,null,null,null,null,null,null,null,"99 - CERRADO",{"$f":"COUNTIF('4 - Planificacion y gestión'!$K$12:$K$41,J20)","v":0}]
[null,null,null,null,null,null,null,null,null,"Total",{"$f":"SUM(K16:K20)","v":0}]

{"sheet":"Análisis","index":5,"n_rows":10,"n_cols":18,"rows_kept":10,"cut":false,"hidden":false,"merged":[]}
[]
[]
[null,"Análisis de la evolución de los riesgos"]
[]
[null,{"$f":"CONCATENATE('1 - Instrucciones'!B10,\": \",'1 - Instrucciones'!E10)","v":"Nombre de Aplicación:: -------------------------------------------------------------------------------------------"}]
[null,{"$f":"CONCATENATE('1 - Instrucciones'!B11,\": \",'1 - Instrucciones'!E11)","v":"VERSIÓN:: -------------------------------------------------------------------------------------------"}]
[null,{"$f":"CONCATENATE('1 - Instrucciones'!B12,\": \",'1 - Instrucciones'!E12)","v":"Jefe de Proyecto: -------------------------------------------------------------------------------------------"}]
[null,{"$f":"CONCATENATE('1 - Instrucciones'!B13,\": \",'1 - Instrucciones'!E13)","v":"Proveedor: -------------------------------------------------------------------------------------------"}]
[]
[null,"Situación actual de los riesgos del proyecto",null,null,null,null,null,"Fecha:",{"$f":"'4 - Planificacion y gestión'!$D$8","v":"2018-03-14"},null,"Tendencia del estado de riesgos del proyecto",null,null,null,null,null,"Fecha:",{"$f":"'4 - Planificacion y gestión'!$D$8","v":"2018-03-14"}]

{"sheet":"Matriz de Riesgos","index":6,"n_rows":18,"n_cols":11,"rows_kept":18,"cut":false,"hidden":false,"merged":[[11,1,15,1],[17,3,17,7]]}
[]
[]
[null,"Matriz de riesgos"]
[]
[null,{"$f":"CONCATENATE('1 - Instrucciones'!B10,\": \",'1 - Instrucciones'!E10)","v":"Nombre de Aplicación:: -------------------------------------------------------------------------------------------"}]
[null,{"$f":"CONCATENATE('1 - Instrucciones'!B11,\": \",'1 - Instrucciones'!E11)","v":"VERSIÓN:: -------------------------------------------------------------------------------------------"}]
[null,{"$f":"CONCATENATE('1 - Instrucciones'!B12,\": \",'1 - Instrucciones'!E12)","v":"Jefe de Proyecto: -------------------------------------------------------------------------------------------"}]
[null,{"$f":"CONCATENATE('1 - Instrucciones'!B13,\": \",'1 - Instrucciones'!E13)","v":"Proveedor: -------------------------------------------------------------------------------------------"}]
[]
[null,"Matriz de Riesgos",null,null,null,null,null,null,null,"Fecha:",{"$f":"'4 - Planificacion y gestión'!$D$8","v":"2018-03-14"}]
[]
[null,"Impacto",10,{"$f":"COUNTIFS('4 - Planificacion y gestión'!$E$12:$E$41,D$17,'4 - Planificacion y gestión'!$F$12:$F$41,$C12)","v":0},{"$f":"COUNTIFS('4 - Planificacion y gestión'!$E$12:$E$41,E$17,'4 - Planificacion y gestión'!$F$12:$F$41,$C12)","v":0},{"$f":"COUNTIFS('4 - Planificacion y gestión'!$E$12:$E$41,F$17,'4 - Planificacion y gestión'!$F$12:$F$41,$C12)","v":0},{"$f":"COUNTIFS('4 - Planificacion y gestión'!$E$12:$E$41,G$17,'4 - Planificacion y gestión'!$F$12:$F$41,$C12)","v":0},{"$f":"COUNTIFS('4 - Planificacion y gestión'!$E$12:$E$41,H$17,'4 - Planificacion y gestión'!$F$12:$F$41,$C12)","v":0}]
[null,null,8,{"$f":"COUNTIFS('4 - Planificacion y gestión'!$E$12:$E$41,D$17,'4 - Planificacion y gestión'!$F$12:$F$41,$C13)","v":0},{"$f":"COUNTIFS('4 - Planificacion y gestión'!$E$12:$E$41,E$17,'4 - Planificacion y gestión'!$F$12:$F$41,$C13)","v":0},{"$f":"COUNTIFS('4 - Planificacion y gestión'!$E$12:$E$41,F$17,'4 - Planificacion y gestión'!$F$12:$F$41,$C13)","v":0},{"$f":"COUNTIFS('4 - Planificacion y gestión'!$E$12:$E$41,G$17,'4 - Planificacion y gestión'!$F$12:$F$41,$C13)","v":0},{"$f":"COUNTIFS('4 - Planificacion y gestión'!$E$12:$E$41,H$17,'4 - Planificacion y gestión'!$F$12:$F$41,$C13)","v":0}]
[null,null,6,{"$f":"COUNTIFS('4 - Planificacion y gestión'!$E$12:$E$41,D$17,'4 - Planificacion y gestión'!$F$12:$F$41,$C14)","v":0},{"$f":"COUNTIFS('4 - Planificacion y gestión'!$E$12:$E$41,E$17,'4 - Planificacion y gestión'!$F$12:$F$41,$C14)","v":0},{"$f":"COUNTIFS('4 - Planificacion y gestión'!$E$12:$E$41,F$17,'4 - Planificacion y gestión'!$F$12:$F$41,$C14)","v":0},{"$f":"COUNTIFS('4 - Planificacion y gestión'!$E$12:$E$41,G$17,'4 - Planificacion y gestión'!$F$12:$F$41,$C14)","v":0},{"$f":"COUNTIFS('4 - Planificacion y gestión'!$E$12:$E$41,H$17,'4 - Planificacion y gestión'!$F$12:$F$41,$C14)","v":0},null,"Zona Total: 3",{"$f":"F12+G12+H12+G13+H13+H14","v":0}]
[null,null,4,{"$f":"COUNTIFS('4 - Planificacion y gestión'!$E$12:$E$41,D$17,'4 - Planificacion y gestión'!$F$12:$F$41,$C15)","v":0},{"$f":"COUNTIFS('4 - Planificacion y gestión'!$E$12:$E$41,E$17,'4 - Planificacion y gestión'!$F$12:$F$41,$C15)","v":0},{"$f":"COUNTIFS('4 - Planificacion y gestión'!$E$12:$E$41,F$17,'4 - Planificacion y gestión'!$F$12:$F$41,$C15)","v":0},{"$f":"COUNTIFS('4 - Planificacion y gestión'!$E$12:$E$41,G$17,'4 - Planificacion y gestión'!$F$12:$F$41,$C15)","v":0},{"$f":"COUNTIFS('4 - Planificacion y gestión'!$E$12:$E$41,H$17,'4 - Planificacion y gestión'!$F$12:$F$41,$C15)","v":0},null,"Zona Total: 2",{"$f":"D12+E12+E13+F13+F14+G14+G15+H15+H16","v":0}]
[null,null,2,{"$f":"COUNTIFS('4 - Planificacion y gestión'!$E$12:$E$41,D$17,'4 - Planificacion y gestión'!$F$12:$F$41,$C16)","v":0},{"$f":"COUNTIFS('4 - Planificacion y gestión'!$E$12:$E$41,E$17,'4 - Planificacion y gestión'!$F$12:$F$41,$C16)","v":0},{"$f":"COUNTIFS('4 - Planificacion y gestión'!$E$12:$E$41,F$17,'4 - Planificacion y gestión'!$F$12:$F$41,$C16)","v":0},{"$f":"COUNTIFS('4 - Planificacion y gestión'!$E$12:$E$41,G$17,'4 - Planificacion y gestión'!$F$12:$F$41,$C16)","v":0},{"$f":"COUNTIFS('4 - Planificacion y gestión'!$E$12:$E$41,H$17,'4 - Planificacion y gestión'!$F$12:$F$41,$C16)","v":0},null,"Zona Total: 1",{"$f":"D13+D14+E14+D15+E15+F15+D16+E16+F16+G16","v":0}]
[null,null,null,0.2,0.4,0.6,0.8,1]
[null,null,null,"Probabilidad"]

{"sheet":"Parametros","index":7,"n_rows":71,"n_cols":8,"rows_kept":71,"cut":false,"hidden":false,"merged":[[7,1,7,2],[12,3,12,4],[6,4,6,6],[7,4,7,6],[8,4,8,5],[9,4,9,5],[10,4,10,5],[59,2,64,2],[36,2,43,2],[22,1,22,3],[12,6,12,7],[44,2,51,2],[52,2,58,2]]}
[]
[]
[null,"Parámetros"]
[]
[null,"Fecha de Revisión:","2014-03-12",{"$f":"CONCATENATE(\"Próxima Revisión: \",DAY(C5+180),\"/\",MONTH(C5+180),\"/\",YEAR(C5+180))","v":"Próxima Revisión: 8/9/2014"}]
[null,"Revisado por:",null,"Aprobado por:"]
[null,null,null,null,"Impacto si ocurre Riesgo Respuesta"]
[null,"Respuestas si Representa un riesgo ",null,null,"a la Pregunta"]
[null,"Respuesta","SI",null,"Impacto",null,"Alto"]
[null,"Respuesta","NO",null,"Impacto",null,"Bajo"]
[null,"Respuesta","No aplica",null,"Impacto",null,"No aplica"]
[]
[null,null,null,"Probabilidad del Riesgo",null,null,"Impacto del Riesgo"]
[null,"Estados para riesgos",null,"Estados para riesgos","Probabilidad %",null,"Expresión","Puntuación"]
[null,"00 - EN GESTION",null,"Poco Probable",0.2,null,"Muy Bajo",2]
[null,"01 - ACTIVACION MITIGACION",null,"Probablemente no suceda",0.4,null,"Bajo",4]
[null,"02 - ACTIVACION CONTINGENCIA",null,"Probable ",0.6,null,"Moderado",6]
[null,"98 - RESUELTO",null,"Altamente Probable",0.8,null,"Alto",8]
[null,"99 - CERRADO",null,"Seguramente suceda",1,null,"Critico",10]
[]
[]
[]
[null,"Motivos para cambios de estado"]
[null,"De","A","Motivo"]
[null,"Propuesto","En gestión","Gestión"]
[null,"En gestión","Activo","Mitigación activada"]
[null,"En gestión","Activo","Contingencia activada"]
[null,"Propuesto / En gestión ","Cerrado","Rechazado (no es un riesgo)",null,"Impacto si ocurre Riesgo Respuesta"]
[null,"Activo","Cerrado","Asumido (se toman acciones correctivas si el riesgo ocurre)",null,"a la Pregunta"]
[null,"Activo","Resuelto","Mitigación finalizada ",null,"Impacto",null,"Alto"]
{"$rows_left_out":41}